{"text_format":"1","workbook":"xlsx","n_sheets":13,"sheets":["Intro","help","Names","Data","Plot","MonteCarlo","Integrator","digitize","graphics","Section","vectors","SlideRule","DXF"],"not_rendered":{"charts":8,"images":12,"macros":1,"external_links":0,"defined_names":19,"comments":0,"pivot_tables":0},"unopened":[],"bounds":{"document_bytes":16777216,"sheet_cells":100000,"rows_first":2000,"rows_last":500,"rows_between":2000,"halvings":0,"cell_chars":16384,"cell_head_chars":4096},"cells_cut":0,"cells_raw":0,"read":"whole","date_system":"1900"}

{"sheet":"Intro","index":0,"n_rows":208,"n_cols":18,"rows_kept":208,"cut":false,"hidden":false,"merged":[[3,1,3,9],[18,8,18,10],[19,8,19,10],[18,6,18,7],[19,6,19,7],[200,4,200,5],[200,6,200,8],[202,4,202,5],[202,6,202,8],[203,4,203,5],[203,6,203,8],[204,4,204,5],[204,6,204,8],[208,4,208,5],[208,6,208,8],[205,4,205,5],[205,6,205,8],[206,4,206,5],[206,6,206,8],[207,4,207,5],[207,6,207,8]]}
["FreeStyle WorkBook",null,null,null,null,null,null,"VVES"]
["Owner@AnalysisChamp.com",null,null,null,null,null,null,"2017-02-22"]
[null,"File:",null,{"$f":"CELL(\"filename\")","v":"C:\\Users\\Owner\\Desktop\\[FreeStyle.xlsm]Intro"}]
[null,"This workbook contains functions for complex unit conversion, air property calculations, 3-d coordinate transforms and interpolation. "]
[]
[null,"Examples of Functions"]
[null,"This workbook contains numerous functions that perform useful calculations.  "]
[null,"The cells with red text can be changed.  The cells with blue text contain formulas."]
[null,"These functions are inserted into cells and formula using the >Insert >Function >User Defined menu commands."]
[]
[]
[null,null,null,null,"This unique workbook has been prepared for you by Mike Van Voorhis  "]
[null,null,null,null,"for calculations and education.  It is fully capable and provided free of cost.  "]
[null,null,null,null,"Please reply with questions or comments.  Thanks!"]
[]
[]
[]
[null,null,null,null,null,"FreeStyle Unit Converter:"]
[null,null,null,null,null,"Value=",2.2000000000000002,null,"hzr",null,null,{"$f":"VLOOKUP(ROUND(UCchkval(I19),8)+0.00000001,Names!$L$1140:$M$1193,2)","v":"1/time"}]
[null,null,null,null,null,"New Value=",{"$f":"cvval(G19,I19,I20)","v":2.2000000000000002},null,"cycle/s",null,null,{"$f":"VLOOKUP(ROUND(UCchkval(I20),8)+0.00000001,Names!$L$1140:$M$1193,2)","v":"1/time"}]
{"$rows_left_out":189}
{"sheet":"help","index":1,"n_rows":429,"n_cols":7,"rows_kept":429,"cut":false,"hidden":false,"merged":[]}
[{"$f":"Intro!A1","v":"FreeStyle WorkBook"}]
[{"$f":"Intro!A2","v":"Owner@AnalysisChamp.com"},null,null,null,{"$f":"Intro!H2","v":"2017-02-22"}]
[]
[null,"Calculation Notes"]
[null,"  This collection of worksheet calculations demonstrates use of the FreeStyle functions in order to allow "]
[null,"you to solve problems accurately. The structure of worksheet calculations consists of six columns of data "]
[null,"for each parameter. The \"Parameter\", Value\", \"Unit\", and \"Comment\" columns contain information "]
[null,"about each.  "]
[]
[null,"   Black vs red cells designate formula and user input cells respectively.  The data in red cells "]
[null,"can be changed without affecting the worksheet calculations.  Data in black cells needs to remain unchanged "]
[null,"as it affects the calculation method for each example.  Intermediate calculations (such as those of temperature "]
[null,"and the universal gas constant, RGC) must remain as listed to properly define these quantities in the "]
[null,"calculations. "]
[]
[null,"   These example calculations may be re-used in your own studies."]
[null,"The red unit strings (input or calculated results) may be changed for your own calculations "]
[null,"(provided the units are still proper) with resulting values calculated correctly."]
[]
[null,"   All examples may be evaluated using the Excel TOOLS > GOAL SEEK function to calculate parameters."]
{"$rows_left_out":410}
{"sheet":"Names","index":2,"n_rows":1193,"n_cols":13,"rows_kept":1193,"cut":false,"hidden":false,"merged":[]}
["Unit Names"]
[null,"Rec","Name","Description","Factor","Bias","Base","Type","Fav","chkval"]
[null,"-",1,2,3,4,5,6,7,"-"]
[null,1,{"$f":"UCFactorData($B4,C$3)","v":"ACRE"},{"$f":"UCFactorData($B4,D$3)","v":"Area - acre"},"4046.8564","0","(M^2)","area","x",{"$f":"UCchkval(G4)","v":289}]
[null,2,{"$f":"UCFactorData($B5,C$3)","v":"ACREFT"},"acre-foot","1233.4818","0","(M^3)","volume","",{"$f":"UCchkval(G5)","v":4913}]
[null,3,"AGATE","agate [Adobe] ","0.0003528","0","(M)","length","",17]
[null,4,"ALEN[DAN]","alen [Danish] ","0.6277","0","(M)","length","",17]
[null,5,"ALEN[SC]","alen [Scandinavia] ","0.6","0","(M)","length","",17]
[null,6,"ALEN[SW]","alen [Swedish] ","0.5938","0","(M)","length","",17]
[null,7,"AMP","ampere electric current","1","0","(AMP)","electric","x",5]
[null,8,"AMU","atomic mass unit (unified, physical)","1.66054021E-27","0","(KG)","mass ","",11]
[null,9,"ANGSTROM","angstrom","0.0000000001","0","(M)","length","x",17]
[null,10,"ARE","Are, area of land","100","0","(M^2)","area","",289]
[null,11,"ARMLEN","arms-length ","0.7","0","(M)","length","",17]
[null,12,"ARPENT[C]","arpent [Canada] ","58.47","0","(M)","length","",17]
[null,13,"ARPENT[F]","arpent [France] ","58.471308","0","(M)","length","",17]
[null,14,"ARSHEEN","arsheen [Russia] ","0.7112","0","(M)","length","",17]
[null,15,"ARSHIN[IRAN]","arshin [iran] ","1.04","0","(M)","length","",17]
[null,16,"ARSHIN[IRAQ]","arshin [iraq] ","74.5","0","(M)","length","",17]
[null,17,"ATM","atmosphere","101325","0","(KG/(M*S^2))","pressure","x",6.7331823468201016E-4]
{"$rows_left_out":1174}
{"sheet":"Data","index":3,"n_rows":177,"n_cols":19,"rows_kept":177,"cut":false,"hidden":false,"merged":[]}
[{"$f":"Intro!H1","v":"VVES"}]
["Analysis - FreeStyle Spreadsheet"]
["MJ Van Voorhis  2/11/2016, 8/25/16"]
[]
[null,"Parameter","Value","Unit","Comment","BaseVal","BaseUnit","ChkVal","Text"]
[]
[null,"Ambient Pressure (absolute) =",1,"(atm)","input value",{"$f":"CVBaseVal(C7,D7)","v":101325},{"$f":"CVBaseUnit(D7)","v":"((KG/(M*S^2)))"},{"$f":"UCchkval(D7)","v":6.7331823468201016E-4},{"$f":"B7&\" \"&TEXT(C7,\"0.00\")&\" \"&D7","v":"Ambient Pressure (absolute) = 1.00 (atm)"}]
[null,"Pressure (gage) =",1180,"(psi)","input value",{"$f":"CVBaseVal(C8,D8)","v":8135813.6057399996},{"$f":"CVBaseUnit(D8)","v":"((KG/(M*S^2)))"},{"$f":"UCchkval(D8)","v":6.7331823468201016E-4},{"$f":"B8&\" \"&TEXT(C8,\"0\")&\" \"&D8","v":"Pressure (gage) = 1180 (psi)"}]
[null,"O.D. =",24,"(in)","input value",{"$f":"CVBaseVal(C9,D9)","v":0.60960000000000003},{"$f":"CVBaseUnit(D9)","v":"((M))"},{"$f":"UCchkval(D9)","v":17}]
[null,"Pressure (absolute) =",{"$f":"cvval(F10,G10,D10)","v":1194.69594877587},"(psi)","=F7+F8",{"$f":"F7+F8","v":8237138.6057399996},{"$f":"IF(AND(H7=H8,H8=H10), CVBaseUnit(D10), NA())","v":"((KG/(M*S^2)))"},{"$f":"UCchkval(D10)","v":6.7331823468201016E-4},{"$f":"B10&\" \"&TEXT(C10,\"0.00E+00\")&\" \"&D10","v":"Pressure (absolute) = 1.19E+03 (psi)"}]
[]
[null,"Diameter1 =",6.4,"(in)","input value",{"$f":"CVBaseVal(C12,D12)","v":0.16256000000000001},{"$f":"CVBaseUnit(D12)","v":"((M))"},{"$f":"UCchkval(D12)","v":17},{"$f":"B12&\" \"&TEXT(C12,\"0.0\")&\" \"&D12","v":"Diameter1 = 6.4 (in)"}]
[null,"Diameter2 =",0,"(in)","input value",{"$f":"CVBaseVal(C13,D13)","v":0},{"$f":"CVBaseUnit(D13)","v":"((M))"},{"$f":"UCchkval(D13)","v":17},{"$f":"B13&\" \"&TEXT(C13,\"0.0\")&\" \"&D13","v":"Diameter2 = 0.0 (in)"}]
[]
[null,"Net Area =",{"$f":"cvval(F15,G15,D15)","v":32.169908772759499},"(in^2)","=PI()/4*(F12^2-F13^2)",{"$f":"PI()/4*(F12^2-F13^2)","v":2.0754738343833512E-2},{"$f":"IF(AND((H12^2=H13^2),(H13^2)=H15), CVBaseUnit(D15), NA())","v":"((M)^2)"},{"$f":"UCchkval(D15)","v":289},{"$f":"B15&\" \"&TEXT(C15,\"0.00E+00\")&\" \"&D15","v":"Net Area = 3.22E+01 (in^2)"}]
[null,"O.D. Area =",{"$f":"cvval(F16,G16,D16)","v":452.38934211692998},"(in^2)","=PI()/4*F9^2",{"$f":"PI()/4*F9^2","v":0.2918635079601587},{"$f":"IF(AND(H9^2=H16), CVBaseUnit(D16), NA())","v":"((M)^2)"},{"$f":"UCchkval(D16)","v":289}]
[null,"Mass-i =",1500,"(lbm)","input value",{"$f":"CVBaseVal(C17,D17)","v":680.388555},{"$f":"CVBaseUnit(D17)","v":"((KG))"},{"$f":"UCchkval(D17)","v":11},{"$f":"B17&\" \"&TEXT(C17,\"0.0\")&\" \"&D17","v":"Mass-i = 1500.0 (lbm)"}]
[null,"Mass-f =",0,"(lbm)","input value",{"$f":"CVBaseVal(C18,D18)","v":0},{"$f":"CVBaseUnit(D18)","v":"((KG))"},{"$f":"UCchkval(D18)","v":11},{"$f":"B18&\" \"&TEXT(C18,\"0.0\")&\" \"&D18","v":"Mass-f = 0.0 (lbm)"}]
[]
[null,"Mass Change =",{"$f":"cvval(F20,G20,D20)","v":1500},"(lbm)","=F17-F18",{"$f":"F17-F18","v":680.388555},{"$f":"IF(AND(H17=H18,H18=H20), CVBaseUnit(D20), NA())","v":"((KG))"},{"$f":"UCchkval(D20)","v":11},{"$f":"B20&\" \"&TEXT(C20,\"0.00E+00\")&\" \"&D20","v":"Mass Change = 1.50E+03 (lbm)"}]
{"$rows_left_out":158}
{"sheet":"Plot","index":4,"n_rows":85,"n_cols":12,"rows_kept":85,"cut":false,"hidden":true,"merged":[]}
[{"$f":"Data!A1","v":"VVES"}]
[{"$f":"Data!A2","v":"Analysis - FreeStyle Spreadsheet"}]
[{"$f":"Data!A3","v":"MJ Van Voorhis  2/11/2016, 8/25/16"}]
[null,null,null,null,null,null,"Coord_1",null,null,"Coord_2"]
[]
[null,null,null,null,null,null,"Angle Slider:",null,null,"Angle Slider:"]
[]
[]
[]
[null,null,null,null,null,null,"Ang_1 =",315,{"$f":"RADIANS(H10)","v":5.497787143782138},"Ang_2 =",404,{"$f":"RADIANS(K10)","v":7.0511301780570914}]
[null,"Scale =",0.4,null,null,null,"x0_1","y0_1","z0_1","x0_2","y0_2","z0_2"]
[null,null,null,null,null,null,0,0,0,0.7,0.2,0]
[null,null,null,null,null,null,"A_1","B_1","C_1","A_2","B_2","C_2"]
[null,null,null,null,null,null,1,0,0,0,1,1]
[]
[null,"Element","point","x","y","z","x_1","y_1","z_1","Plot_x","Plot_y","Plot_z"]
[null,"Axis-x","PtX0",0,0,0,{"$f":"CXFxp(G$12,H$12,I$12,G$14,H$14,I$14,I$10,$C$11*D17,$C$11*E17,$C$11*F17)","v":0},{"$f":"CXFyp(G$12,H$12,I$12,G$14,H$14,I$14,I$10,$C$11*D17,$C$11*E17,$C$11*F17)","v":0},{"$f":"CXFzp(G$12,H$12,I$12,G$14,H$14,I$14,I$10,$C$11*D17,$C$11*E17,$C$11*F17)","v":0},{"$f":"CXFxp(J$12,K$12,L$12,J$14,K$14,L$14,L$10,G17,H17,I17)","v":-0.7},{"$f":"CXFyp(J$12,K$12,L$12,J$14,K$14,L$14,L$10,G17,H17,I17)","v":-0.2},{"$f":"CXFzp(J$12,K$12,L$12,J$14,K$14,L$14,L$10,G17,H17,I17)","v":0}]
[null,{"$f":"B17","v":"Axis-x"},"PtX1",1,0,0,0.4,0,0,-0.41226407986453945,-0.39647905774382153,0.19647905774382154]
[null,"Axis-y","PtY0",0,0,0,0,0,0,-0.7,-0.2,0]
[null,{"$f":"B19","v":"Axis-y"},"PtY1",0,1,0,0,0.28284271247461895,0.28284271247461906,-0.7,8.284271247461894E-2,0.28284271247461901]
{"$rows_left_out":66}
{"sheet":"MonteCarlo","index":5,"n_rows":274,"n_cols":20,"rows_kept":274,"cut":false,"hidden":true,"merged":[]}
["CALCULATION WORKBOOK"]
["Analysis template"]
["xxxxxxxxxx   xx/xx/xx",null,null,"Press F9 to recalculate"]
[]
[null,"UNIFORM DISTRIBUTION",null,null,null,null,null,null,null,null,null,null,null,null,null,"NORMAL DISTRIBUTION"]
[]
[null,"Average","Range",null,null,null,null,null,null,null,null,null,null,null,null,"Average","Range"]
[null,10,10,null,null,null,null,null,null,null,null,null,null,null,null,10,10]
[]
[]
[null,"Case","Value",null,"bin","freq",null,null,null,null,null,null,null,null,null,"Case","Value",null,"bin","freq"]
[null,1,{"$f":"($C$8)*RAND()+($B$8-$C$8/2)","v":8.6899585333616791},null,{"$f":"($C$8)*0+($B$8-$C$8/2)","v":5},{"$f":"FREQUENCY(C12:C274,E12:E22)","v":0},null,null,null,null,null,null,null,null,null,1,{"$f":"((($Q$8)*RAND()+($P$8-$Q$8/2))+(($Q$8)*RAND()+($P$8-$Q$8/2))+(($Q$8)*RAND()+($P$8-$Q$8/2))+(($Q$8)*RAND()+($P$8-$Q$8/2))+(($Q$8)*RAND()+($P$8-$Q$8/2)))/5","v":8.6302088280551263},null,{"$f":"($Q$8)*0+($P$8-$Q$8/2)","v":5},{"$f":"FREQUENCY(Q12:Q274,S12:S22)","v":0}]
[null,2,6.6400167764562266,null,{"$f":"($C$8)*0.1+($B$8-$C$8/2)","v":6},15,null,null,null,null,null,null,null,null,null,2,{"$f":"((($Q$8)*RAND()+($P$8-$Q$8/2))+(($Q$8)*RAND()+($P$8-$Q$8/2))+(($Q$8)*RAND()+($P$8-$Q$8/2))+(($Q$8)*RAND()+($P$8-$Q$8/2))+(($Q$8)*RAND()+($P$8-$Q$8/2)))/5","v":10.211484167944223},null,{"$f":"($Q$8)*0.1+($P$8-$Q$8/2)","v":6},0]
[null,3,7.3918314329075887,null,{"$f":"($C$8)*0.2+($B$8-$C$8/2)","v":7},34,null,null,null,null,null,null,null,null,null,3,9.1562834497909638,null,{"$f":"($Q$8)*0.2+($P$8-$Q$8/2)","v":7},3]
[null,4,8.912929382126574,null,{"$f":"($C$8)*0.3+($B$8-$C$8/2)","v":8},27,null,null,null,null,null,null,null,null,null,4,9.1293564354069296,null,{"$f":"($Q$8)*0.3+($P$8-$Q$8/2)","v":8},16]
[null,5,11.770635137620884,null,{"$f":"($C$8)*0.4+($B$8-$C$8/2)","v":9},31,null,null,null,null,null,null,null,null,null,5,10.339524191507357,null,{"$f":"($Q$8)*0.4+($P$8-$Q$8/2)","v":9},42]
[null,6,13.331659374362877,null,{"$f":"($C$8)*0.5+($B$8-$C$8/2)","v":10},21,null,null,null,null,null,null,null,null,null,6,9.1756924911877942,null,{"$f":"($Q$8)*0.5+($P$8-$Q$8/2)","v":10},79]
[null,7,12.352649771331418,null,{"$f":"($C$8)*0.6+($B$8-$C$8/2)","v":11},27,null,null,null,null,null,null,null,null,null,7,10.515698651118344,null,{"$f":"($Q$8)*0.6+($P$8-$Q$8/2)","v":11},68]
[null,8,11.541874939196557,null,{"$f":"($C$8)*0.7+($B$8-$C$8/2)","v":12},27,null,null,null,null,null,null,null,null,null,8,10.71573687454854,null,{"$f":"($Q$8)*0.7+($P$8-$Q$8/2)","v":12},42]
[null,9,11.238566765687242,null,{"$f":"($C$8)*0.8+($B$8-$C$8/2)","v":13},27,null,null,null,null,null,null,null,null,null,9,11.276085114638699,null,{"$f":"($Q$8)*0.8+($P$8-$Q$8/2)","v":13},10]
{"$rows_left_out":255}
{"sheet":"Integrator","index":6,"n_rows":341,"n_cols":9,"rows_kept":341,"cut":false,"hidden":true,"merged":[]}
[{"$f":"Data!A1","v":"VVES"}]
[{"$f":"Data!A2","v":"Analysis - FreeStyle Spreadsheet"}]
[{"$f":"Data!A3","v":"MJ Van Voorhis  2/11/2016, 8/25/16"}]
[]
[null,"INTEGRATOR"]
[]
[null,null,"step=",0.01]
[]
[null,null,"x","f(x)",null,"low/up","min/max","f'(x)"]
[null,null,0,{"$f":"xvector^2","v":0},null,0,{"$f":"MIN($C$10:C341)","v":0},{"$f":"1/3*F10^3","v":0}]
[null,null,{"$f":"C10+$D$7","v":0.01},1E-4,null,3.3,{"$f":"MAX($C$10:C342)","v":3.3099999999999734},{"$f":"1/3*F11^3","v":11.978999999999999}]
[null,null,0.02,4.0000000000000002E-4,null,"int=",{"$f":"integrate($C$10:$C$341,$D$10:$D$341,F10,F11)","v":12.087954999999999},{"$f":"H11-H10","v":11.978999999999999},{"$f":"G12/H12-1","v":9.0955004591368738E-3}]
[null,null,0.03,8.9999999999999998E-4]
[null,null,0.04,1.6000000000000001E-3]
[null,null,0.05,2.5000000000000005E-3]
[null,null,6.0000000000000005E-2,3.6000000000000008E-3]
[null,null,7.0000000000000007E-2,4.9000000000000007E-3]
[null,null,0.08,6.4000000000000003E-3]
[null,null,0.09,8.0999999999999996E-3]
[null,null,9.9999999999999992E-2,9.9999999999999985E-3]
{"$rows_left_out":322}
{"sheet":"digitize","index":7,"n_rows":28,"n_cols":13,"rows_kept":28,"cut":false,"hidden":true,"merged":[]}
["VAN VOORHIS ENGINEERING SERVICES"]
["Digitization of Data - Analysis Workbook"]
["MikeVV@AnalysisChamp.com ,  9/4/2012, 1/4/2013"]
[]
[]
[]
[]
[]
[]
[]
[]
[]
[]
[]
[]
[]
[]
[]
[]
[]
{"$rows_left_out":9}
{"sheet":"graphics","index":8,"n_rows":24,"n_cols":47,"rows_kept":24,"cut":false,"hidden":false,"merged":[]}
[{"$f":"Intro!H1&\"  8/25/2016\"","v":"VVES  8/25/2016"}]
["Graphic Measurement - Analysis Workbook"]
[{"$f":"Intro!A2","v":"Owner@AnalysisChamp.com"}]
[]
[]
[]
[]
[null,"IMAGE 01 - Scale and Measurement",null,null,null,null,null,null,null,null,null,null,null,null,null,null,null,null,null,1.03,"in",null," <= Known feature length (red line)",null,null,null,null,null,null,null,null,null,null,null,null,null,null,null,null,{"$f":"TEXT(T15,\"0.00\")&\" \"&U15","v":"0.84 in"}]
[]
[null,null,null,null,null,null,null,null,null,null,null,null,null,null,null,null,null,null,null,"scale:"]
[null,null,null,null,null,null,null,null,null,null,null,null,null,null,null,null,null,null,null,{"$f":"T8/shapedatafunction(curshname(),W14)","v":1.389682716389835E-2}," =T8/shapedatafunction(curshname(),W14)"]
[]
[null,null,null,null,null,null,null,null,null,null,null,null,null,null,null,null,null,null,null,"measurements:",null,null,null,null,null,null,null,null,null,null,null,null,null,null,null,null,null,null,null,null,null,null,null,null,null,"Places x,y coordinates of all freeform shapes at curser location"]
[null,null,null,null,null,null,null,null,null,null,null,null,null,null,null,null,null,null,null,{"$f":"cvval(shapedatafield(curshname(),W14,\"linelength\")*T11,U8,U14)","v":1.03},"in",null,"Straight Connector 62",null,null,null,null,null,null,null,"Known length (red)"]
[null,null,null,null,null,null,null,null,null,null,null,null,null,null,null,null,null,null,null,{"$f":"cvval(shapedatafield(curshname(),W15,\"linelength\")*T11,U8,U15)","v":0.84464828534700298},"in",null,"Straight Connector 4",null,null,null,null,null,null,null,"unknown length (yellow)"]
[null,null,null,null,null,null,null,null,null,null,null,null,null,null,null,null,null,null,null,{"$f":"cvval(shapedatafield(curshname(),W16,\"linelength\")*T11,U8,U16)","v":2.2620560709455901},"in",null,"Freeform 19",null,null,null,null,null,null,null,"unknown length (green)"]
[null,null,null,null,null,null,null,null,null,null,null,null,null,null,null,null,null,null,null,null,null,null,null,null,null,null,null,null,null,null,null,null,null,null,null,null,null,null,null,null,null,null,null,null,null,null,"Places freeform shape at x,y coordinates beginning with curser location"]
[null,null,null,null,null,null,null,null,null,null,null,null,null,null,null,null,null,"width",null,{"$f":"cvval(shapedatafield(curshname(),W18,R18)*$T$11,$U$8,U18)","v":2.0661320258777698},{"$f":"U20","v":"in"},null,"Rectangle 1"]
[null,null,null,null,null,null,null,null,null,null,null,null,null,null,null,null,null,"height",null,{"$f":"cvval(shapedatafield(curshname(),W19,R19)*$T$11,$U$8,U19)","v":1.30037424855223},{"$f":"U20","v":"in"},null,{"$f":"W18","v":"Rectangle 1"}]
[null,null,null,null,null,null,null,null,null,null,null,null,null,null,null,null,null,"diagonal",null,{"$f":"(T18^2+T19^2)^(1/2)","v":2.4412854676697591},"in",null,{"$f":"W19","v":"Rectangle 1"}]
{"$rows_left_out":5}
{"sheet":"Section","index":9,"n_rows":66,"n_cols":8,"rows_kept":66,"cut":false,"hidden":true,"merged":[]}
["SECTION CALCULATION WORKBOOK"]
[{"$f":"Data!A2","v":"Analysis - FreeStyle Spreadsheet"}]
[{"$f":"Data!A3","v":"MJ Van Voorhis  2/11/2016, 8/25/16"}]
[null,3.3,1.4]
[]
[null,"X-coord","Y-Coord"]
[null,1,9]
[null,{"$f":"B7+$B$4","v":4.3},6.5]
[null,{"$f":"B8+$B$4","v":7.6},5]
[null,10.899999999999999,4]
[null,14.2,4]
[null,17.5,5]
[null,20.8,6.5]
[null,24.1,9]
[null,23.4,{"$f":"C14+C4","v":10.4}]
[null,20,{"$f":"C13+C4","v":7.9}]
[null,{"$f":"B12","v":17.5},{"$f":"C12+C4","v":6.4}]
[null,{"$f":"B11","v":14.2},{"$f":"C11+C4","v":5.4}]
[null,{"$f":"B10","v":10.899999999999999},{"$f":"C10+C4","v":5.4}]
[null,7.6,{"$f":"C9+C4","v":6.4}]
{"$rows_left_out":47}
{"sheet":"vectors","index":10,"n_rows":23,"n_cols":9,"rows_kept":23,"cut":false,"hidden":true,"merged":[]}
[{"$f":"Data!A1","v":"VVES"}]
[{"$f":"Data!A2","v":"Analysis - FreeStyle Spreadsheet"}]
[{"$f":"Data!A3","v":"MJ Van Voorhis  2/11/2016, 8/25/16"},null,"red = user input, black = calculated value"]
[]
[null,"Vector Cross and Dot Product Calculations",null,null,null,null,"data from map generated using Sketchup terrane saved as 3d .dxf"]
[null,null,"x","y","z",null,"x'","y'","z'"]
[null,"vecA = ",1,0,0,null,-236.00720000000001,89.087500000000006,-130.87029999999999]
[null,"vecB = ",0,1,0,null,-234.67570000000001,242.46879999999999,-125.56529999999999]
[null,"vecC = ",0,0,1,null,-117.6027,88.06,-91.567499999999995]
[null,"vecD = ",0,0,0,null,-118.93340000000001,86.006500000000003,0]
[]
[null,"data:",null,null,null,null,"formula:"]
[null,"vecA - vecD =",{"$f":"C7-C10","v":1},{"$f":"D7-D10","v":0},{"$f":"E7-E10","v":0},null,"=C7-C10","=D7-D10","=E7-E10"]
[null,"vecB - vecD =",{"$f":"C8-C10","v":0},{"$f":"D8-D10","v":1},{"$f":"E8-E10","v":0},null,"=C8-C10","=D8-D10","=E8-E10"]
[null,"vecC - vecD =",{"$f":"C9-C10","v":0},{"$f":"D9-D10","v":0},{"$f":"E9-E10","v":1},null,"=C9-C10","=D9-D10","=E9-E10"]
[]
[null,"(vecB-vecD)x(vecC-vecD) =",{"$f":"D14*E15-E14*D15","v":1},{"$f":"E14*C15-C14*E15","v":0},{"$f":"C14*D15-D14*C15","v":0},null,"=D14*E15-E14*D15","=E14*C15-C14*E15","=C14*D15-D14*C15"]
[null,"http://en.wikipedia.org/wiki/Cross_product"]
[null,"(vecA-vecD) . (vecB-vecD)x(vecC-vecD) =",{"$f":"ABS(C13*C17+D13*D17+E13*E17)","v":1},null,null,null,"=ABS(C13*C17+D13*D17+E13*E17)"]
[null,"http://en.wikipedia.org/wiki/Dot_proct"]
{"$rows_left_out":4}
{"sheet":"SlideRule","index":11,"n_rows":25,"n_cols":30,"rows_kept":25,"cut":false,"hidden":true,"merged":[]}
["SlideRule"]
[null,null,null,null,null,null,null,null,null,null,null,null,null,null,null,null,null,null,null,null,null,null,null,null,null,null,null,null,null,"http://www.antiquark.com/sliderule/sim/n909es/virtual-n909-es.html"]
[null,null,null,null,null,null,null,null,null,null,null,null,null,null,null,null,null,null,null,null,null,null,null,null,null,null,null,null,null,"FRONT SIDE"]
[]
[]
[]
[]
[]
[]
[]
[]
[]
[]
[]
[]
[]
[]
[]
[]
[null,null,null,null,null,null,null,null,null,null,null,null,null,null,null,null,null,null,null,null,null,null,null,null,null,null,null,"multiplication / division:","C & D scales"]
{"$rows_left_out":6}
{"sheet":"DXF","index":12,"n_rows":37,"n_cols":8,"rows_kept":37,"cut":false,"hidden":true,"merged":[]}
[]
[null,"file:","C:\\Users\\Owner\\Desktop\\FSGD-MVV160825.dxf"]
[null,"sheet:","DXF"]
[null,"scale:",1,null,null,null,null,"Sub VERTEXPOINTS() provides polyline coordinates"]
[null,"layer:",0]
[]
[]
[]
[null,".xls: ",{"$f":"CELL(\"filename\")","v":"C:\\Users\\Owner\\Desktop\\[FreeStyle.xlsm]Intro"}]
[]
[]
[]
[]
[]
[]
[]
[]
[]
[]
[]
{"$rows_left_out":17}